Target
COUP transcription factor 2
Ligand
BDBM89292
Substrate
IC50
3378±n/a nM
Citation
 PubChem, PC Luminescence-based cell-based high throughput dose response assay to identify inhibitors of COUP-TFII (NR2F2) PubChem Bioassay (2013)[AID] 
Target
Name:
COUP transcription factor 2
Synonyms:
ARP1 COUP transcription factor 2 isoform a TFCOUP2
Type:
Enzyme Catalytic Domain
Mol. Mass.:
45583.83
Organism:
Homo sapiens (Human)
Description:
gi_14149746
Residue:
414
  
Inhibitor
Name:
BDBM89292
Synonyms:
2,3-dihydro-1,4-benzodioxin-3-ylmethyl-(5,6-dimethylthieno[2,3-d]pyrimidin-4-yl)amine N-(2,3-dihydro-1,4-benzodioxin-3-ylmethyl)-5,6-dimethyl-4-thieno[2,3-d]pyrimidinamine N-(2,3-dihydro-1,4-benzodioxin-3-ylmethyl)-5,6-dimethylthieno[2,3-d]pyrimidin-4-amine cid_5253159
Type:
Small organic molecule
Emp. Form.:
C17H17N3O2S
Mol. Mass.:
327.401
SMILES:
Cc1sc2ncnc(NCC3COc4ccccc4O3)c2c1C
: