Target
Cathepsin K
Ligand
BDBM100291
Substrate
Meas. Tech.
In Vitro Inhibition Assay
Ki
0.35±0.0 nM
Citation
 Quibell, MWatts, JP Piperazine compounds US Patent  US8501744 Publication Date 8/6/2013 
Target
Name:
Cathepsin K
Synonyms:
CATK_HUMAN CTSO Cathepsin O Cathepsin X
Type:
Enzyme
Mol. Mass.:
36975.68
Organism:
Homo sapiens (Human)
Description:
P43235
Residue:
329
  
Inhibitor
Name:
BDBM100291
Synonyms:
US8501744, 7
Type:
Small organic molecule
Emp. Form.:
C26H36N4O4
Mol. Mass.:
468.5884
SMILES:
C[C@H]1CN([C@H]2[C@@H]1OCC2=O)C(=O)[C@@H](NC(=O)c1ccc(cc1)N1CCN(C)CC1)C1CCCC1
: