Target
Tyrosine-protein kinase JAK2
Ligand
BDBM100348
Substrate
Meas. Tech.
Binding Assay
Kd
5.1±0.0 nM
Citation
 Bauer, SMJia, ZJMehrotra, MSong, YXu, QHuang, WVenkataramani, CRose, JWPandey, A Inhibitors of protein kinases US Patent  US8501944 Publication Date 8/6/2013 
Target
Name:
Tyrosine-protein kinase JAK2
Synonyms:
JAK-2 JAK2_HUMAN Janus kinase 2 (JAK2) | Janus kinase 2 (a protein tyrosine kinase)
Type:
Protein
Mol. Mass.:
130684.68
Organism:
Homo sapiens (Human)
Description:
O60674
Residue:
1132
  
Inhibitor
Name:
BDBM100348
Synonyms:
US10533001, Example Table 9a.1 US8501944, 370 US9868729, Example 38
Type:
Small organic molecule
Emp. Form.:
C21H27N7O3
Mol. Mass.:
425.4842
SMILES:
COCC(=O)N1CCN(CC1)c1ccc(Nc2ncc(C(N)=O)c(NC3CC3)n2)cc1
: