Target
Fatty-acid amide hydrolase 1
Ligand
BDBM280477
Substrate
Meas. Tech.
In Vitro Competitive Activity-Based Protein Profiling
IC50
>1000±n/a nM
Citation
 Cisar, JSGrice, CAJones, TKWeber, ODBuzard, DJShaghafi, MB Spirocycle compounds and methods of making and using same US Patent  US10030020 Publication Date 7/24/2018 
Target
Name:
Fatty-acid amide hydrolase 1
Synonyms:
Anandamide amidohydrolase FAAH1_MOUSE Faah1 Fatty-acid amide hydrolase (FAAH) Oleamide hydrolase 1
Type:
Hydrolase; single-pass membrane protein; homodimer
Mol. Mass.:
63227.28
Organism:
Mus musculus (mouse)
Description:
Mouse brain membranes were used in the assay.
Residue:
579
  
Inhibitor
Name:
BDBM280477
Synonyms:
US10030020, Example 22 | US10781211, Example 22
Type:
Small organic molecule
Emp. Form.:
C24H28F9N3O3
Mol. Mass.:
577.483
SMILES:
FC(F)(F)C(OC(=O)N1CCC2(CCN(Cc3ccc(cc3N3CCOCC3)C(F)(F)F)C2)CC1)C(F)(F)F
: