Target
Fatty-acid amide hydrolase 1
Ligand
BDBM280484
Substrate
Meas. Tech.
In Vitro Competitive Activity-Based Protein Profiling
IC50
>1000±n/a nM
Citation
 Cisar, JSGrice, CAJones, TKWeber, ODBuzard, DJShaghafi, MB Spirocycle compounds and methods of making and using same US Patent  US10030020 Publication Date 7/24/2018 
Target
Name:
Fatty-acid amide hydrolase 1
Synonyms:
Anandamide amidohydrolase FAAH1_MOUSE Faah1 Fatty-acid amide hydrolase (FAAH) Oleamide hydrolase 1
Type:
Hydrolase; single-pass membrane protein; homodimer
Mol. Mass.:
63227.28
Organism:
Mus musculus (mouse)
Description:
Mouse brain membranes were used in the assay.
Residue:
579
  
Inhibitor
Name:
BDBM280484
Synonyms:
US10030020, Example 29 | US10781211, Example 29
Type:
Small organic molecule
Emp. Form.:
C21H24F8N2O3
Mol. Mass.:
504.4141
SMILES:
FCCOc1cc(CN2CCCC22CCN(CC2)C(=O)OC(C(F)(F)F)C(F)(F)F)ccc1F
: