Target
Monoglyceride lipase
Ligand
BDBM280485
Substrate
Meas. Tech.
In Vitro Competitive Activity-Based Protein Profiling
IC50
<100±n/a nM
Citation
 Cisar, JSGrice, CAJones, TKWeber, ODBuzard, DJShaghafi, MB Spirocycle compounds and methods of making and using same US Patent  US10030020 Publication Date 7/24/2018 
Target
Name:
Monoglyceride lipase
Synonyms:
MAG lipase Mgll Monoglyceride Lipase (MGL)
Type:
Hydrolase
Mol. Mass.:
33391.67
Organism:
Mus musculus (mouse)
Description:
Assays were using membranes of recombinant MAG Lipase transiently transfected in COS-7 cells.
Residue:
303
  
Inhibitor
Name:
BDBM280485
Synonyms:
US10030020, Example 30 | US10781211, Example 30
Type:
Small organic molecule
Emp. Form.:
C21H24ClF7N2O3
Mol. Mass.:
520.869
SMILES:
FCCOc1cc(Cl)ccc1CN1CCCC11CCN(CC1)C(=O)OC(C(F)(F)F)C(F)(F)F
: