Target
Monoglyceride lipase
Ligand
BDBM280581
Substrate
Meas. Tech.
In Vitro Competitive Activity-Based Protein Profiling
IC50
<100±n/a nM
Citation
 Cisar, JSGrice, CAJones, TKWeber, ODBuzard, DJShaghafi, MB Spirocycle compounds and methods of making and using same US Patent  US10030020 Publication Date 7/24/2018 
Target
Name:
Monoglyceride lipase
Synonyms:
MAG lipase Mgll Monoglyceride Lipase (MGL)
Type:
Hydrolase
Mol. Mass.:
33391.67
Organism:
Mus musculus (mouse)
Description:
Assays were using membranes of recombinant MAG Lipase transiently transfected in COS-7 cells.
Residue:
303
  
Inhibitor
Name:
BDBM280581
Synonyms:
US10030020, Example 126 | US10781211, Example 126
Type:
Small organic molecule
Emp. Form.:
C21H24F6N2O4
Mol. Mass.:
482.4167
SMILES:
FC(F)(F)C(OC(=O)N1CCC2(CCCN2Cc2ccc3OCCOc3c2)CC1)C(F)(F)F
: