Target
Monoacylglycerol lipase ABHD2
Ligand
BDBM280610
Substrate
Meas. Tech.
In Vitro Competitive Activity-Based Protein Profiling
IC50
550±n/a nM
Citation
 Cisar, JSGrice, CAJones, TKWeber, ODBuzard, DJShaghafi, MB Spirocycle compounds and methods of making and using same US Patent  US10030020 Publication Date 7/24/2018 
Target
Name:
Monoacylglycerol lipase ABHD2
Synonyms:
2-arachidonoylglycerol hydrolase Abhd2 Labh-2 Lung alpha/beta hydrolase 2 | MmLABH2
Type:
Enzyme Catalytic Domain
Mol. Mass.:
48378.90
Organism:
Mus musculus (Mouse)
Description:
Residue:
425
  
Inhibitor
Name:
BDBM280610
Synonyms:
US10030020, Example 155 | US10781211, Example 155
Type:
Small organic molecule
Emp. Form.:
C23H28ClF6N3O2
Mol. Mass.:
527.931
SMILES:
FC(F)(F)C(OC(=O)N1CCC2(CCN(Cc3ccc(Cl)c(c3)N3CCCC3)C2)CC1)C(F)(F)F
: