Target
Monoglyceride lipase
Ligand
BDBM280668
Substrate
Meas. Tech.
In Vitro Competitive Activity-Based Protein Profiling (Human)
Temperature
298.15±n/a K
IC50
<100±n/a nM
Comments
extracted
Citation
 Cisar, JSGrice, CAJones, TKWeber, ODBuzard, DJShaghafi, MB Spirocycle compounds and methods of making and using same US Patent  US10030020 Publication Date 7/24/2018 
Target
Name:
Monoglyceride lipase
Synonyms:
HU-K5 Lysophospholipase-like MGL MGLL_HUMAN
Type:
Hydrolase
Mol. Mass.:
33264.56
Organism:
Homo sapiens (Human)
Description:
Human recombinant MGL (Cayman Chemical, cat# 10008354).
Residue:
303
  
Inhibitor
Name:
BDBM280668
Synonyms:
US10030020, Example 217 | US10781211, Example 217
Type:
Small organic molecule
Emp. Form.:
C26H30F9N3O4
Mol. Mass.:
619.5197
SMILES:
OC(=O)[C@H]1CCCN(C1)c1cc(ccc1CN1CCCC11CCN(CC1)C(=O)OC(C(F)(F)F)C(F)(F)F)C(F)(F)F
: