Target
Pro-glucagon
Ligand
BDBM100824
Substrate
Meas. Tech.
Glucagon SPA Assay
pH
7.4±0
Ki
51±0.0 nM
Citation
 Aspnes, GEDidiuk, MTFilipski, KJGuzman-Perez, ALee, ECPfefferkorn, JAStevens, BDTu, MM Glucagon receptor modulators US Patent  US8507533 Publication Date 8/13/2013 
Target
Name:
Pro-glucagon
Synonyms:
GCG Glucagon | Glucagon receptor (GCGR)
Type:
Enzyme
Mol. Mass.:
20907.95
Organism:
Homo sapiens (Human)
Description:
P01275
Residue:
180
  
Inhibitor
Name:
BDBM100824
Synonyms:
US8507533, 131
Type:
Small organic molecule
Emp. Form.:
C28H30F3N3O4
Mol. Mass.:
529.5507
SMILES:
Cc1cc(OC(C2CCCC2)c2ccc(cc2)C(=O)NCCC(O)=O)cc(C)c1-n1cnc(c1)C(F)(F)F
: