Target
Pro-glucagon
Ligand
BDBM100850
Substrate
Meas. Tech.
Glucagon SPA Assay
pH
7.4±0
Ki
27.4±0.0 nM
Citation
 Aspnes, GEDidiuk, MTFilipski, KJGuzman-Perez, ALee, ECPfefferkorn, JAStevens, BDTu, MM Glucagon receptor modulators US Patent  US8507533 Publication Date 8/13/2013 
Target
Name:
Pro-glucagon
Synonyms:
GCG Glucagon | Glucagon receptor (GCGR)
Type:
Enzyme
Mol. Mass.:
20907.95
Organism:
Homo sapiens (Human)
Description:
P01275
Residue:
180
  
Inhibitor
Name:
BDBM100850
Synonyms:
US8507533, 168
Type:
Small organic molecule
Emp. Form.:
C26H30F3N5O3
Mol. Mass.:
517.5433
SMILES:
CC(C)C[C@@H](Nc1ccc(cn1)C(=O)NCCC(O)=O)c1cc(C)c(c(C)c1)-n1cc(cn1)C(F)(F)F
: