Target
Calcitonin gene-related peptide type 1 receptor
Ligand
BDBM100865
Substrate
Meas. Tech.
Binding Assay
Ki
0.057±0.0 nM
Citation
 Wood, MRBell, IMKim, JJSelnick, HGStump, CA 3- and 6-quinolines with N-attached heterocyclic CGRP receptor antagonists US Patent  US8507477 Publication Date 8/13/2013 
Target
Name:
Calcitonin gene-related peptide type 1 receptor
Synonyms:
Adrenomedullin receptor AM1; CALCRL/RAMP2 CALRL_HUMAN CGRP type 1 receptor mRNA Calcitonin gene-related peptide (CGRP) receptor Calcitonin receptor-like receptor Human CL receptor
Type:
Enzyme Catalytic Domain
Mol. Mass.:
52980.45
Organism:
Homo sapiens (Human)
Description:
Q16602
Residue:
461
  
Inhibitor
Name:
BDBM100865
Synonyms:
US8507477, 5
Type:
Small organic molecule
Emp. Form.:
C34H31N5O3
Mol. Mass.:
557.6416
SMILES:
CC(C)N1C(=O)N(Cc2cnc3cc4C[C@]5(Cc4cc3c2)C(=O)Nc2ncccc52)C2(CCCc3ccccc23)C1=O
: