Target
Sodium- and chloride-dependent glycine transporter 1
Ligand
BDBM100969
Substrate
Meas. Tech.
Uptake Inhibition Assay
Temperature
273.15±n/a K
IC50
25.3±n/a nM
Citation
 Kolczewski, SPinard, E Tetrahydro-pyran derivatives US Patent  US8524909 Publication Date 9/3/2013 
Target
Name:
Sodium- and chloride-dependent glycine transporter 1
Synonyms:
Glycine transporter 1b SLC6A9
Type:
Protein
Mol. Mass.:
71324.09
Organism:
Bos taurus (Bovine)
Description:
Q28039
Residue:
638
  
Inhibitor
Name:
BDBM100969
Synonyms:
US8524909, 51
Type:
Small organic molecule
Emp. Form.:
C19H25F3N2O2
Mol. Mass.:
370.4092
SMILES:
Cc1cc(cc(C)c1C(=O)N[C@H]1COCC[C@@H]1N1CCCC1)C(F)(F)F
: