Target
Platelet-derived growth factor receptor beta
Ligand
BDBM4168
Substrate
poly(E:Y)
Meas. Tech.
Kinase Inhibition Assay
pH
7±n/a
Temperature
298.15±n/a K
IC50
3600±n/a nM
Citation
 Thompson, AMRewcastle, GWBoushelle, SLHartl, BGKraker, AJLu, GHBatley, BLPanek, RLShowalter, HDDenny, WA Synthesis and structure-activity relationships of 7-substituted 3-(2, 6-dichlorophenyl)-1,6-naphthyridin-2(1H)-ones as selective inhibitors of pp60(c-src). J Med Chem 43:3134-47 (2000)  
Target
Name:
Platelet-derived growth factor receptor beta
Synonyms:
Beta-type platelet-derived growth factor receptor CD140b antigen PDGF Receptor Substrate PDGFR PDGFR-1 PDGFRB PGFRB_HUMAN Platelet-derived growth factor receptor 1 Platelet-derived growth factor receptor beta (PDGFR-beta) Platelet-derived growth factor receptor beta (PDGFRbeta) | VHL/PDGFRB
Type:
Enzyme
Mol. Mass.:
123922.25
Organism:
Homo sapiens (Human)
Description:
P09619
Residue:
1106
  
Inhibitor
Name:
BDBM4168
Synonyms:
1,6-naphthyridin-2(1H)-one deriv. 7a 7-amino-3-(2,6-dichlorophenyl)-1-methyl-1,2-dihydro-1,6-naphthyridin-2-one
Type:
Small organic molecule
Emp. Form.:
C15H11Cl2N3O
Mol. Mass.:
320.173
SMILES:
Cn1c2cc(N)ncc2cc(-c2c(Cl)cccc2Cl)c1=O
:
Substrate
Name:
poly(E:Y)
Synonyms:
Type:
Random Copolymer
Mol. Mass.:
358.43
Organism:
Description:
poly (4:1) glutamate-tyrosine. 50 uM ATP and 0.4 uCi [gamma-32P]ATP as co-substrate.
Residue:
3
NA