Target
Epidermal growth factor receptor
Ligand
BDBM101235
Substrate
Meas. Tech.
Inhibition Assay
pH
7±0
Temperature
295.15±0 K
IC50
5.0±0.0 nM
Citation
 Schirok, HLi-Sommer, YBrands, MLobell, MTersteegen, AHimmel, HSchlemmer, KLang, DPetersen, KRenz, MMumberg, DHoffmann, JSiemeister, GBömer, U Substituted tricyclic compounds and methods of use thereof US Patent  US8524722 Publication Date 9/3/2013 
Target
Name:
Epidermal growth factor receptor
Synonyms:
EGF Receptor Substrate EGFR_HUMAN ERBB1 Epidermal Growth Factor Receptor erbB-1 Epidermal growth factor receptor (EGFR) HER1 Proto-oncogene c-ErbB-1 Tyrosine-Protein Kinase ErbB-1
Type:
Receptor Kinase Domain
Mol. Mass.:
134279.59
Organism:
Homo sapiens (Human)
Description:
P00533
Residue:
1210
  
Inhibitor
Name:
BDBM101235
Synonyms:
US8524722, 86
Type:
Small organic molecule
Emp. Form.:
C27H25ClFN5O2S
Mol. Mass.:
538.036
SMILES:
CN(C)C\C=C\C(=O)N1Cc2sc3ncnc(Nc4ccc(OCc5cccc(F)c5)c(Cl)c4)c3c2C1
: