Target
Genome polyprotein
Ligand
BDBM101337
Substrate
Meas. Tech.
Inhibition Assay
Temperature
298.15±0 K
IC50
1.44e+3±n/a nM
Citation
 Raboisson, PJHu, LVendeville, SMNyanguile, OTahri, A Macrocyclic indoles as hepatitis C virus inhibitors US Patent  US8524716 Publication Date 9/3/2013 
Target
Name:
Genome polyprotein
Synonyms:
POLG_HCVJ4 | RNA-directed RNA polymerase (NS5B)
Type:
Enzyme
Mol. Mass.:
326827.17
Organism:
Hepatitis C virus genotype 1b (strain HC-J4) (HCV)
Description:
O92972
Residue:
3010
  
Inhibitor
Name:
BDBM101337
Synonyms:
US8524716, 16
Type:
Small organic molecule
Emp. Form.:
C45H43ClN4O3
Mol. Mass.:
723.301
SMILES:
COc1ccc(-c2ccc(Cl)cc2)c(c1)-c1ccc2cc(ccc2n1)-c1c(C2CCCCC2)c2ccc3cc2n1CC(=O)NCC\C=C/CCNC3=O
: