Target
Transmembrane prolyl 4-hydroxylase
Ligand
BDBM3723
Substrate
Meas. Tech.
In Vitro Inhibition Assay
pH
7.5±0
Temperature
298.15±0 K
IC50
2.8e+3±n/a nM
Citation
 Thede, KFlamme, IOehme, FErgüden, JStoll, FSchuhmacher, JWild, HKolkhof, PBeck, HAkbaba, MJeske, M Substituted dihydropyrazolones and use thereof as HIF-prolyl-4-hydroxylase inhibitors US Patent  US8524699 Publication Date 9/3/2013 
Target
Name:
Transmembrane prolyl 4-hydroxylase
Synonyms:
Hypoxia-inducible factor prolyl 4-hydroxylase Hypoxia-inducible factor prolyl hydroxylase 4 P4HTM PH4 | Transmembrane prolyl 4-hydroxylase
Type:
Enzyme
Mol. Mass.:
56654.25
Organism:
Homo sapiens (Human)
Description:
Q9NXG6
Residue:
502
  
Inhibitor
Name:
BDBM3723
Synonyms:
US8524699, 6
Type:
Emp. Form.:
C15H10N4OS
Mol. Mass.:
294.331
SMILES:
O=c1c(c[nH]n1-c1nc2ccccc2s1)-c1cccnc1
: