Target
Kappa-type opioid receptor
Ligand
BDBM4538
Substrate
Meas. Tech.
Binding Assay
Ki
1.3±0 nM
Citation
 Kyle, DJGoehring, RRFundytus, ME Buprenophine analogs US Patent  US8530494 Publication Date 9/10/2013 
Target
Name:
Kappa-type opioid receptor
Synonyms:
K-OR-1 Kappa-opioid receptor (KOR) Kappa-type opioid receptor (KOR) OPIATE Kappa OPRK1 kappa opioid receptor (KOR)
Type:
G Protein-Coupled Receptor (GPCR)
Mol. Mass.:
42648.76
Organism:
Homo sapiens (Human)
Description:
P41145
Residue:
380
  
Inhibitor
Name:
BDBM4538
Synonyms:
US8530494, 7
Type:
Emp. Form.:
C27H34N2O4
Mol. Mass.:
450.5699
SMILES:
COc1ccc2C[C@H]3N(CC4CC4)CC[C@@]45[C@@H](Oc1c24)C1(CC[C@@]35C[C@@H]1COCC#N)OC
: