Target
Delta-type opioid receptor
Ligand
BDBM3992
Substrate
Meas. Tech.
Binding Assay
Ki
89.96±0 nM
Citation
 Kyle, DJGoehring, RRFundytus, ME Buprenophine analogs US Patent  US8530494 Publication Date 9/10/2013 
Target
Name:
Delta-type opioid receptor
Synonyms:
D-OR-1 Delta opioid receptor OPIATE Delta OPRD1 OPRK1 | opioid receptor, delta 1
Type:
G Protein-Coupled Receptor (GPCR)
Mol. Mass.:
40382.98
Organism:
Homo sapiens (Human)
Description:
Competition binding assays were carried out using membrane preparations from transfected HN9.10 cells that constitutively expressed the delta opioid receptor.
Residue:
372
  
Inhibitor
Name:
BDBM3992
Synonyms:
US8530494, 201
Type:
Emp. Form.:
C29H41NO4
Mol. Mass.:
467.6401
SMILES:
COc1ccc2C[C@H]3N(C)CC[C@@]45[C@@H](Oc1c24)[C@]1(CC[C@@]35C[C@@H]1COCC1CCCCC1)OC
: