Target
Serine/threonine-protein kinase PAK 4
Ligand
BDBM101556
Substrate
Meas. Tech.
Enzymatic Assay
Ki
41±n/a nM
EC50
>2000±0.0 nM
Citation
 Zhang, JGuo, CBouzida, DDong, LLi, HMarakovits, JTYang, AHong, Y Pyrrolopyrazoles, potent kinase inhibitors US Patent  US8530652 Publication Date 9/10/2013 
Target
Name:
Serine/threonine-protein kinase PAK 4
Synonyms:
KIAA1142 PAK4_HUMAN | p21-Activated kinase 4 (PAK4)
Type:
Protein
Mol. Mass.:
64098.01
Organism:
Homo sapiens (Human)
Description:
O96013
Residue:
591
  
Inhibitor
Name:
BDBM101556
Synonyms:
US8530652, 1
Type:
Small organic molecule
Emp. Form.:
C23H23N7OS
Mol. Mass.:
445.54
SMILES:
CC1(C)N(Cc2c(Nc3ncnc4ccsc34)[nH]nc12)C(=O)N[C@H]1CC1c1ccccc1
: