Target
Serine/threonine-protein kinase PAK 4
Ligand
BDBM101478
Substrate
Meas. Tech.
Enzymatic Assay
Ki
2.2e+2±n/a nM
EC50
87±0 nM
Citation
 Zhang, JGuo, CBouzida, DDong, LLi, HMarakovits, JTYang, AHong, Y Pyrrolopyrazoles, potent kinase inhibitors US Patent  US8530652 Publication Date 9/10/2013 
Target
Name:
Serine/threonine-protein kinase PAK 4
Synonyms:
KIAA1142 PAK4_HUMAN | p21-Activated kinase 4 (PAK4)
Type:
Protein
Mol. Mass.:
64098.01
Organism:
Homo sapiens (Human)
Description:
O96013
Residue:
591
  
Inhibitor
Name:
BDBM101478
Synonyms:
US8524710, 55 US8530652, 5
Type:
Small organic molecule
Emp. Form.:
C24H28N8OS
Mol. Mass.:
476.597
SMILES:
CN(C)C[C@@H](NC(=O)N1Cc2c(Nc3ncnc4ccsc34)n[nH]c2C1(C)C)c1ccccc1
: