Target
Serine/threonine-protein kinase PAK 4
Ligand
BDBM101537
Substrate
Meas. Tech.
Enzymatic Assay
Ki
3±n/a nM
EC50
<3.9±0.0 nM
Citation
 Zhang, JGuo, CBouzida, DDong, LLi, HMarakovits, JTYang, AHong, Y Pyrrolopyrazoles, potent kinase inhibitors US Patent  US8530652 Publication Date 9/10/2013 
Target
Name:
Serine/threonine-protein kinase PAK 4
Synonyms:
KIAA1142 PAK4_HUMAN | p21-Activated kinase 4 (PAK4)
Type:
Protein
Mol. Mass.:
64098.01
Organism:
Homo sapiens (Human)
Description:
O96013
Residue:
591
  
Inhibitor
Name:
BDBM101537
Synonyms:
US8530494, 204 US8530652, 64
Type:
Small organic molecule
Emp. Form.:
C27H29N9O
Mol. Mass.:
495.5789
SMILES:
CN(C)C[C@@H](NC(=O)N1Cc2c(Nc3nc(nc4ccccc34)C#N)[nH]nc2C1(C)C)c1ccccc1
: