Target
Deoxyuridine 5'-triphosphate nucleotidohydrolase, mitochondrial
Ligand
BDBM5223
Substrate
Meas. Tech.
Inhibition Assay
IC50
480±n/a nM
Citation
 Fukuoka, MYokogawa, TMiyahara, SMiyakoshi, HYano, WTaguchi, JTakao, Y Uracil compound or salt thereof having human deoxyuridine triphosphatase inhibitory activity US Patent  US8530490 Publication Date 9/10/2013 
Target
Name:
Deoxyuridine 5'-triphosphate nucleotidohydrolase, mitochondrial
Synonyms:
DUT Deoxyuridine 5'-triphosphate nucleotidohydrolase (dUTPase) dUTP pyrophosphatase
Type:
Enzyme
Mol. Mass.:
26574.03
Organism:
Homo sapiens (Human)
Description:
P33316
Residue:
252
  
Inhibitor
Name:
BDBM5223
Synonyms:
US8530490, 130
Type:
Emp. Form.:
C24H27N3O5S
Mol. Mass.:
469.553
SMILES:
OC(C1CCCN1S(=O)(=O)CCCn1ccc(=O)[nH]c1=O)(c1ccccc1)c1ccccc1
: