Target
Deoxyuridine 5'-triphosphate nucleotidohydrolase, mitochondrial
Ligand
BDBM101888
Substrate
Meas. Tech.
Inhibition Assay
IC50
9.48e+3±n/a nM
Citation
 Fukuoka, MYokogawa, TMiyahara, SMiyakoshi, HYano, WTaguchi, JTakao, Y Uracil compound or salt thereof having human deoxyuridine triphosphatase inhibitory activity US Patent  US8530490 Publication Date 9/10/2013 
Target
Name:
Deoxyuridine 5'-triphosphate nucleotidohydrolase, mitochondrial
Synonyms:
DUT Deoxyuridine 5'-triphosphate nucleotidohydrolase (dUTPase) dUTP pyrophosphatase
Type:
Enzyme
Mol. Mass.:
26574.03
Organism:
Homo sapiens (Human)
Description:
P33316
Residue:
252
  
Inhibitor
Name:
BDBM101888
Synonyms:
CHEMBL1234485 | US8530490, 158
Type:
Small organic molecule
Emp. Form.:
C17H23N3O5S
Mol. Mass.:
381.447
SMILES:
CC(C)(CCCOCn1ccc(=O)[nH]c1=O)NS(=O)(=O)c1ccccc1
: