Target
Isoform 3 of Acetyl-CoA carboxylase 2 (ACC2.v2)
Ligand
BDBM101930
Substrate
Meas. Tech.
Enzyme Assay
IC50
6.7e+2±n/a nM
Citation
 Fleck, MNosse, BHeine, NRoth, GJ Azetidine derivatives US Patent  US8530460 Publication Date 9/10/2013 
Target
Name:
Isoform 3 of Acetyl-CoA carboxylase 2 (ACC2.v2)
Synonyms:
ACACB ACC2 Acetyl-CoA carboxylase 2 (ACC2) | Acetyl-CoA carboxylase 2 (ACC2.v2)
Type:
Protein
Mol. Mass.:
255085.30
Organism:
Homo sapiens (Human)
Description:
AJ575592.3
Residue:
2256
  
Inhibitor
Name:
BDBM101930
Synonyms:
US8530460, 1.10
Type:
Small organic molecule
Emp. Form.:
C21H26N4O3
Mol. Mass.:
382.4561
SMILES:
CC(NC(C)=O)c1ccc(OC2CN(C2)c2cnc(OC3CCC3)nc2)cc1
: