Target
Orexin receptor type 2
Ligand
BDBM102281
Substrate
Meas. Tech.
FLIPR Assay
pH
7.4±0
Ki
69±n/a nM
Citation
 Badiger, SBehnke, DBetschart, CChaudhari, VCotesta, SHinrichs, JHOfner, SPandit, CWagner, J Diaza-spiro[5.5]undecanes US Patent  US8530648 Publication Date 9/10/2013 
Target
Name:
Orexin receptor type 2
Synonyms:
HCRTR2 OX2R_HUMAN Orexin receptor type 2 (OR-2) Orexin receptor type 2 (OX2R) Ox-2-R | Ox2-R
Type:
Protein
Mol. Mass.:
50710.53
Organism:
Homo sapiens (Human)
Description:
O43614
Residue:
444
  
Inhibitor
Name:
BDBM102281
Synonyms:
US8530648, 218
Type:
Small organic molecule
Emp. Form.:
C25H27N5O
Mol. Mass.:
413.5148
SMILES:
O=C1N(Cc2c[nH]c3ccccc23)CCCC11CCN(CC1)c1nc2ccccc2[nH]1
: