Target
Egl nine homolog 1
Ligand
BDBM102337
Substrate
Meas. Tech.
Enzyme Assay
IC50
1.2e+4±n/a nM
Citation
 Gardner, JHShalwitz, R Prolyl hydroxylase inhibitors US Patent  US8536181 Publication Date 9/17/2013 
Target
Name:
Egl nine homolog 1
Synonyms:
C1orf12 EGLN1_HUMAN Hypoxia-inducible factor prolyl hydroxylase 2 (HIF-PH2) Prolyl hydroxylase domain-containing protein 2 (PHD2)
Type:
Protein
Mol. Mass.:
46035.59
Organism:
Homo sapiens (Human)
Description:
Q9GZT9
Residue:
426
  
Inhibitor
Name:
BDBM102337
Synonyms:
US10562854, No. C35 US9278930, C35
Type:
Small organic molecule
Emp. Form.:
C19H22N4O2
Mol. Mass.:
338.4036
SMILES:
Oc1c(CNCCCn2ccnc2)ccn(Cc2ccccc2)c1=O
: