Target
Egl nine homolog 1
Ligand
BDBM102347
Substrate
Meas. Tech.
Enzyme Assay
IC50
1.2e+4±n/a nM
Citation
 Gardner, JHShalwitz, R Prolyl hydroxylase inhibitors US Patent  US8536181 Publication Date 9/17/2013 
Target
Name:
Egl nine homolog 1
Synonyms:
C1orf12 EGLN1_HUMAN Hypoxia-inducible factor prolyl hydroxylase 2 (HIF-PH2) Prolyl hydroxylase domain-containing protein 2 (PHD2)
Type:
Protein
Mol. Mass.:
46035.59
Organism:
Homo sapiens (Human)
Description:
Q9GZT9
Residue:
426
  
Inhibitor
Name:
BDBM102347
Synonyms:
US10562854, No. C1 US9278930, C1
Type:
Small organic molecule
Emp. Form.:
C20H19ClN2O2
Mol. Mass.:
354.83
SMILES:
Oc1c(CNCc2ccccc2)ccn(Cc2ccc(Cl)cc2)c1=O
: