Target
Vascular endothelial growth factor A
Ligand
BDBM102349
Substrate
Meas. Tech.
ELISA Assay
IC50
2.1e+3±n/a nM
Citation
 Gardner, JHShalwitz, R Prolyl hydroxylase inhibitors US Patent  US8536181 Publication Date 9/17/2013 
Target
Name:
Vascular endothelial growth factor A
Synonyms:
VEGF VEGFA VPF Vascular endothelial growth factor A (VEGF) Vascular permeability factor
Type:
Protein
Mol. Mass.:
27063.81
Organism:
Homo sapiens (Human)
Description:
P15692
Residue:
232
  
Inhibitor
Name:
BDBM102349
Synonyms:
US10562854, No. E33 US9278930, E33
Type:
Small organic molecule
Emp. Form.:
C16H18N2O6S
Mol. Mass.:
366.389
SMILES:
CN(CC(O)=O)Cc1ccn(c(=O)c1O)S(=O)(=O)c1ccc(C)cc1
: