Target
Glutamate receptor ionotropic, NMDA 2B
Ligand
BDBM280729
Substrate
Meas. Tech.
NR2B Antagonist Activity
Temperature
298.15±n/a K
IC50
28.0±n/a nM
Comments
extracted
Citation
 Shapiro, G Difluoroethylpyridine derivatives as NR2B NMDA receptor antagonists US Patent  US10030026 Publication Date 7/24/2018 
Target
Name:
Glutamate receptor ionotropic, NMDA 2B
Synonyms:
GRIN2B Glutamate [NMDA] receptor subunit epsilon 2 N-methyl D-aspartate receptor subtype 2B NMDAR2B NR3 | hNR3
Type:
PROTEIN
Mol. Mass.:
166375.46
Organism:
Homo sapiens (Human)
Description:
ChEMBL_1438829
Residue:
1484
  
Inhibitor
Name:
BDBM280729
Synonyms:
US10030026, Compound C-11
Type:
Small organic molecule
Emp. Form.:
C18H18F5N7O
Mol. Mass.:
443.3738
SMILES:
FC(F)(F)Oc1ccc(nc1)C(F)(F)CN1CCC(CC1)Nc1ncnc2[nH]ncc12
: