Target
Dihydroorotate dehydrogenase (quinone), mitochondrial
Ligand
BDBM102468
Substrate
Meas. Tech.
Inhibition Assay
pH
8±0
IC50
28±0.0 nM
Citation
 Castro Palomino Laria, JCTerricabras Belart, EErra Sola, MNavarro Romero, EFonquerna Pou, SCardus Figueras, ALozoya Toribio, ME Azabiphenylaminobenzoic acid derivatives as DHODH inhibitors US Patent  US8536165 Publication Date 9/17/2013 
Target
Name:
Dihydroorotate dehydrogenase (quinone), mitochondrial
Synonyms:
DHODH Dihydroorotate dehydrogenase Dihydroorotate dehydrogenase, mitochondrial Dihydroorotate oxidase (DHODH) | PYRD_HUMAN
Type:
Enzyme
Mol. Mass.:
42881.33
Organism:
Homo sapiens (Human)
Description:
Q02127
Residue:
395
  
Inhibitor
Name:
BDBM102468
Synonyms:
US8536165, 61
Type:
Small organic molecule
Emp. Form.:
C22H21FN2O3
Mol. Mass.:
380.4121
SMILES:
CC(C)Oc1ccc(F)c(c1)-c1ccc(Nc2ccc(C)cc2C(O)=O)cn1
: