Target
Serine/threonine-protein kinase receptor R3
Ligand
BDBM50262685
Substrate
IC50
19.5±0.0 nM
Citation
 Mohedas, AHXing, XArmstrong, KABullock, ANCuny, GDYu, PB Development of an ALK2-Biased BMP Type I Receptor Kinase Inhibitor. ACS Chem Biol 8:1291-302 (2013)  
Target
Name:
Serine/threonine-protein kinase receptor R3
Synonyms:
ACVL1_MOUSE AI427544 Acvrl1 Alk-1
Type:
Protein
Mol. Mass.:
56529.91
Organism:
Mus musculus
Description:
Residue:
502
  
Inhibitor
Name:
BDBM50262685
Synonyms:
6-(4-(2-(piperidin-1-yl)ethoxy)phenyl)-3-(pyridin-4-yl)pyrazolo[1,5-a]pyrimidine CHEMBL478629 US9040694, Dorsomorphin
Type:
Small organic molecule
Emp. Form.:
C24H25N5O
Mol. Mass.:
399.4882
SMILES:
C(CN1CCCCC1)Oc1ccc(cc1)-c1cnc2c(cnn2c1)-c1ccncc1
: