Target
Activin receptor type-1B
Ligand
BDBM102619
Substrate
IC50
232±0.0 nM
Citation
 Mohedas, AHXing, XArmstrong, KABullock, ANCuny, GDYu, PB Development of an ALK2-Biased BMP Type I Receptor Kinase Inhibitor. ACS Chem Biol 8:1291-302 (2013)  
Target
Name:
Activin receptor type-1B
Synonyms:
6820432J04 ActR-IB Acvr1b Alk4 | SKR2
Type:
Mol. Mass.:
56705.93
Organism:
Mus musculus
Description:
Residue:
505
  
Inhibitor
Name:
BDBM102619
Synonyms:
K02288a US11701353, Compound 382_0087_0284
Type:
Small organic molecule
Emp. Form.:
C20H20N2O4
Mol. Mass.:
352.3838
SMILES:
COc1cc(cc(OC)c1OC)-c1cc(cnc1N)-c1cccc(O)c1
: