Target
Guanylate cyclase soluble subunit alpha-1
Ligand
BDBM280917
Substrate
Meas. Tech.
sGC Binding Assay
pH
7.4±n/a
Ki
0.052±n/a nM
Comments
extracted
Citation
 Berger, RChen, YLi, GGarfunkle, JLi, HMiao, SRaghavan, SSmith, CJStelmach, JWhitehead, AZhang, RZhang, YFu, JJi, GJiang, F Soluble guanylate cyclase stimulators US Patent  US10030027 Publication Date 7/24/2018 
Target
Name:
Guanylate cyclase soluble subunit alpha-1
Synonyms:
GCS-alpha-1 GCYA1_HUMAN GUCSA3 GUCY1A3 Guanylate cyclase soluble subunit alpha-3 Solube guanylate cyclase alpha-1 (sGCalpha) | soluble guanylate cyclase alpha-1 (sGC)
Type:
Enzyme
Mol. Mass.:
77457.21
Organism:
Homo sapiens (Human)
Description:
Q02108
Residue:
690
  
Inhibitor
Name:
BDBM280917
Synonyms:
4-(2-{4-amino-2- [6-fluoro-1-(2- fluorobenzyl)-1H- indazol-3-yl]-5- methyl-6-oxo- 6,7-dihydro-5H- pyrrolo[2,3-d] pyrimidin-5-yl}- 1,3-oxazol-4-yl)- 2,2-dimethyl- butanoic acid US10428076, Example 193B
Type:
Small organic molecule
Emp. Form.:
C30H27F2N7O4
Mol. Mass.:
587.5767
SMILES:
CC(C)(CCc1coc(n1)C1(C)C(=O)Nc2nc(nc(N)c12)-c1nn(Cc2ccccc2F)c2cc(F)ccc12)C(O)=O
: