Target
Guanylate cyclase soluble subunit alpha-1
Ligand
BDBM280981
Substrate
Meas. Tech.
sGC Binding Assay
pH
7.4±n/a
Ki
0.074±n/a nM
Comments
extracted
Citation
 Berger, RChen, YLi, GGarfunkle, JLi, HMiao, SRaghavan, SSmith, CJStelmach, JWhitehead, AZhang, RZhang, YFu, JJi, GJiang, F Soluble guanylate cyclase stimulators US Patent  US10030027 Publication Date 7/24/2018 
Target
Name:
Guanylate cyclase soluble subunit alpha-1
Synonyms:
GCS-alpha-1 GCYA1_HUMAN GUCSA3 GUCY1A3 Guanylate cyclase soluble subunit alpha-3 Solube guanylate cyclase alpha-1 (sGCalpha) | soluble guanylate cyclase alpha-1 (sGC)
Type:
Enzyme
Mol. Mass.:
77457.21
Organism:
Homo sapiens (Human)
Description:
Q02108
Residue:
690
  
Inhibitor
Name:
BDBM280981
Synonyms:
(S)-4-Amino-2-[6-chloro-1-(2-fluorobenzyl)-1H-indazol-3-yl]-5-methyl-5-{4-[2-(5-oxo-4,5-dihydro-1,2,4-oxadiazol-3-yl)ethyl]phenyl}-5,7-dihydro-6H-pyrrolo[2,3-d]pyrimidin-6-one | US10030027, Example 256B
Type:
Small organic molecule
Emp. Form.:
C31H24ClFN8O3
Mol. Mass.:
611.025
SMILES:
C[C@]1(C(=O)Nc2nc(nc(N)c12)-c1nn(Cc2ccccc2F)c2cc(Cl)ccc12)c1ccc(CCc2noc(=O)[nH]2)cc1
: