Target
Growth hormone secretagogue receptor type 1
Ligand
BDBM102976
Substrate
Meas. Tech.
Competitive Binding Assay
IC50
1.3±n/a nM
Citation
 Aicher, BMueller, GPaulini, KBlumenstein, LSchmidt, PGerlach, MTeifel, MMartinez, JFehrentz, JBlayo, A Triazole derivatives with improved receptor activity and bioavailability properties as ghrelin antagonists of growth hormone secretagogue receptors US Patent  US8546435 Publication Date 10/1/2013 
Target
Name:
Growth hormone secretagogue receptor type 1
Synonyms:
GH-releasing peptide receptor GHS-R GHSR_HUMAN Ghrelin receptor | Ghrelin receptor 1a (GHS-R1a)
Type:
Receptor
Mol. Mass.:
41334.57
Organism:
Homo sapiens (Human)
Description:
Receptor binding studies use plasma membranes from LLC PK-1 cells transiently transfected with hGHSR1a.
Residue:
366
  
Inhibitor
Name:
BDBM102976
Synonyms:
US8546435, 4
Type:
Small organic molecule
Emp. Form.:
C36H35N7O3
Mol. Mass.:
613.7082
SMILES:
COc1ccc(Cn2c(nnc2[C@@H](Cc2ccccc2)NC(C)=O)[C@@H](Cc2c[nH]c3ccccc23)NC(=O)c2ccccn2)cc1
: