Target
Sodium/glucose cotransporter 2
Ligand
BDBM50308456
Substrate
Meas. Tech.
Inhibition Assay
IC50
257±0.0 nM
Citation
 Lee, JLee, SHSeo, HJKim, MJKang, SYKim, JLee, SJung, MESon, EJSong, KKim, M C-aryl glucoside SGLT2 inhibitors and pharmaceutical compositions comprising same US Patent  US8541380 Publication Date 9/24/2013 
Target
Name:
Sodium/glucose cotransporter 2
Synonyms:
Na(+)/glucose cotransporter 2 SGLT2 Sodium-Dependent Glucose Cotransporter 2 (SGLT2) Solute carrier family 5 member 2
Type:
Protein
Mol. Mass.:
72902.00
Organism:
Homo sapiens (Human)
Description:
P31639
Residue:
672
  
Inhibitor
Name:
BDBM50308456
Synonyms:
(2S,3R,4R,5S,6R)-2-(4-Chloro-3-((5-(5-methylisoxazol-3-yl)-1,3,4-thiadiazol-2-yl)methyl)phenyl)-6-(hydroxymethyl)-tetrahydro-2H-pyran-3,4,5-triol US8541380, 12
Type:
Small organic molecule
Emp. Form.:
C19H20ClN3O6S
Mol. Mass.:
453.897
SMILES:
Cc1cc(no1)-c1nnc(Cc2cc(ccc2Cl)[C@@H]2O[C@H](CO)[C@@H](O)[C@H](O)[C@H]2O)s1
: