Target
Somatostatin receptor type 2
Ligand
BDBM405705
Substrate
Meas. Tech.
cAMP Assay
EC50
<10±n/a nM
Citation
 Zhao, JHan, SKim, SHWang, SZhu, Y Somatostatin modulators and uses thereof US Patent  US10351547 Publication Date 7/16/2019 
Target
Name:
Somatostatin receptor type 2
Synonyms:
SOMATOSTATIN SST2 SS-2-R SS2R SSTR2 | Somatostatin receptor type 2 (SSTR2)
Type:
Enzyme
Mol. Mass.:
41344.94
Organism:
Homo sapiens (Human)
Description:
P30874
Residue:
369
  
Inhibitor
Name:
BDBM405705
Synonyms:
US10351547, Compound 2-172 | US10597377, Compound 2-172
Type:
Small organic molecule
Emp. Form.:
C28H28F2N6O2
Mol. Mass.:
518.5577
SMILES:
CONC(=O)Nc1c(F)cncc1-c1ccc2ncc(-c3cc(C)cc(F)c3)c(N3CCC(N)CC3)c2c1
: