Target
Somatostatin receptor type 2
Ligand
BDBM405801
Substrate
Meas. Tech.
cAMP Assay
EC50
55±n/a nM
Citation
 Zhao, JHan, SKim, SHWang, SZhu, Y Somatostatin modulators and uses thereof US Patent  US10351547 Publication Date 7/16/2019 
Target
Name:
Somatostatin receptor type 2
Synonyms:
SOMATOSTATIN SST2 SS-2-R SS2R SSTR2 | Somatostatin receptor type 2 (SSTR2)
Type:
Enzyme
Mol. Mass.:
41344.94
Organism:
Homo sapiens (Human)
Description:
P30874
Residue:
369
  
Inhibitor
Name:
BDBM405801
Synonyms:
US10351547, Compound 2-271
Type:
Small organic molecule
Emp. Form.:
C30H27FN4O2
Mol. Mass.:
494.5594
SMILES:
Cc1cc(F)cc(c1)-c1cnc2ccc(cc2c1N1CC(C1)C1COCCN1)-c1cccc(C#N)c1O
: