Target
Kinesin-like protein KIF11
Ligand
BDBM34535
Substrate
Meas. Tech.
In Vitro Assay
IC50
49.41±n/a nM
Citation
 Abrams, TBarsanti, PDing, YDuhl, DHan, WHu, CPan, Y Triazole compounds as KSP inhibitors US Patent  US8546434 Publication Date 10/1/2013 
Target
Name:
Kinesin-like protein KIF11
Synonyms:
EG5 KIF11_HUMAN Kinesin Spindle Protein Eg5 TRIP5 | kinesin spindle protein
Type:
PROTEIN
Mol. Mass.:
119138.97
Organism:
Homo sapiens (Human)
Description:
ChEMBL_1457426
Residue:
1056
  
Inhibitor
Name:
BDBM34535
Synonyms:
US8546434, 9
Type:
Emp. Form.:
C32H39F4N5O3
Mol. Mass.:
617.6774
SMILES:
CCN1C[C@H](F)[C@H](CN([C@@H](c2nc(nn2Cc2cccc(F)c2)-c2cc(F)ccc2F)C(C)(C)OC)C(=O)[C@@H]2CCCO2)C1
: