Target
Cathepsin S
Ligand
BDBM34544
Substrate
Meas. Tech.
In Vitro Inhibition Assay
Ki
555±n/a nM
Citation
 Quibell, MWatts, JPFlinn, NS Furo[3, 2-B] pyrrol-3-ones as cathespin S inhibitors US Patent  US8552202 Publication Date 10/8/2013 
Target
Name:
Cathepsin S
Synonyms:
CATS_HUMAN Cathepsin S (Cat S) | cathepsin S preproprotein
Type:
Protein
Mol. Mass.:
37507.38
Organism:
Homo sapiens (Human)
Description:
P25774
Residue:
331
  
Inhibitor
Name:
BDBM34544
Synonyms:
US8552202, Compound 38
Type:
Emp. Form.:
C22H28N2O4
Mol. Mass.:
384.4687
SMILES:
O=C(NC(CC1CCCCC1)C(=O)N1CC[C@H]2OCC(=O)[C@@H]12)c1ccccc1
: