Target
Cathepsin S
Ligand
BDBM103360
Substrate
Meas. Tech.
In Vitro Inhibition Assay
Ki
24±0.0 nM
Citation
 Quibell, MWatts, JPFlinn, NS Furo[3, 2-B] pyrrol-3-ones as cathespin S inhibitors US Patent  US8552202 Publication Date 10/8/2013 
Target
Name:
Cathepsin S
Synonyms:
CATS_HUMAN Cathepsin S (Cat S) | cathepsin S preproprotein
Type:
Protein
Mol. Mass.:
37507.38
Organism:
Homo sapiens (Human)
Description:
P25774
Residue:
331
  
Inhibitor
Name:
BDBM103360
Synonyms:
US8552202, Compound 11
Type:
Small organic molecules
Emp. Form.:
C23H27FN6O4
Mol. Mass.:
470.4967
SMILES:
C[C@H]1CC[C@@H](CC1)[C@H](NC(=O)c1cccc(c1)-n1cnnn1)C(=O)N1C[C@H](F)[C@H]2OCC(=O)[C@@H]12
: