Target
Cathepsin L2
Ligand
BDBM103350
Substrate
Meas. Tech.
In Vitro Inhibition Assay
Ki
700±0.0 nM
Citation
 Quibell, MWatts, JPFlinn, NS Furo[3, 2-B] pyrrol-3-ones as cathespin S inhibitors US Patent  US8552202 Publication Date 10/8/2013 
Target
Name:
Cathepsin L2
Synonyms:
CATL2 CTSL2 CTSV Cathepsin V
Type:
Enzyme
Mol. Mass.:
37341.06
Organism:
Homo sapiens (Human)
Description:
O60911
Residue:
334
  
Inhibitor
Name:
BDBM103350
Synonyms:
US8552202, Compound 2
Type:
Small organic molecules
Emp. Form.:
C21H25FN2O4
Mol. Mass.:
388.4326
SMILES:
F[C@H]1CN([C@H]2[C@@H]1OCC2=O)C(=O)[C@@H](NC(=O)c1ccccc1)C1CCCCC1
: