Target
Melatonin receptor type 1B
Ligand
BDBM103441
Substrate
Meas. Tech.
Binding Assay
IC50
0.31±0.0 nM
Citation
 Uchikawa, OKoike, THoashi, YTakai, T Tricyclic compound and pharmaceutical use thereof US Patent  US8552037 Publication Date 10/8/2013 
Target
Name:
Melatonin receptor type 1B
Synonyms:
MTNR1B Mel-1B-R Melatonin 1B Melatonin receptor type 1B | Melatonin receptor type 2 (MT2)
Type:
Enzyme
Mol. Mass.:
40203.54
Organism:
Homo sapiens (Human)
Description:
P49286
Residue:
362
  
Inhibitor
Name:
BDBM103441
Synonyms:
US8552037, 87
Type:
Small organic molecule
Emp. Form.:
C14H16N2O2
Mol. Mass.:
244.289
SMILES:
CC(=O)NCCC1CCc2ccc3ncoc3c12
: