Target
Serine/threonine-protein kinase ATR
Ligand
BDBM103473
Substrate
Meas. Tech.
Cellular Assay
IC50
53.61±n/a nM
Citation
 Foote, KMTurner, PNissink, JW Chemical compounds US Patent  US8552004 Publication Date 10/8/2013 
Target
Name:
Serine/threonine-protein kinase ATR
Synonyms:
ATR Ataxia telangiectasia and Rad3-related protein (ATR) FRP1 | Serine-protein kinase ATR
Type:
Protein
Mol. Mass.:
301404.58
Organism:
Homo sapiens (Human)
Description:
Q13535
Residue:
2644
  
Inhibitor
Name:
BDBM103473
Synonyms:
US8552004, 4.01
Type:
Small organic molecule
Emp. Form.:
C23H31N7O3S
Mol. Mass.:
485.602
SMILES:
CNc1nc2ccccc2n1-c1nc(cc(n1)C1(CCOCC1)[S@@](C)(=N)=O)N1CCOC[C@H]1C
: