Target
Calcitonin gene-related peptide type 1 receptor
Ligand
BDBM103501
Substrate
Meas. Tech.
Native Receptor Binding Assay
pH
7.4±0
Ki
0.13±0.0 nM
Citation
 Wood, MRKim, JJSelnick, HGStachel, SJ Non-amidic linkers with branched termini as CGRP receptor antagonists US Patent  US8552023 Publication Date 10/8/2013 
Target
Name:
Calcitonin gene-related peptide type 1 receptor
Synonyms:
Adrenomedullin receptor AM1; CALCRL/RAMP2 CALRL_HUMAN CGRP type 1 receptor mRNA Calcitonin gene-related peptide (CGRP) receptor Calcitonin receptor-like receptor Human CL receptor
Type:
Enzyme Catalytic Domain
Mol. Mass.:
52980.45
Organism:
Homo sapiens (Human)
Description:
Q16602
Residue:
461
  
Inhibitor
Name:
BDBM103501
Synonyms:
US8552023, 13
Type:
Small organic molecule
Emp. Form.:
C31H33FN4O2
Mol. Mass.:
512.6177
SMILES:
C[C@@H](N(C\C=C\c1cnc2C[C@]3(Cc2c1)C(=O)Nc1ncccc31)C(=O)C(C)(C)C)c1ccc(C)c(F)c1
: