Target
5-hydroxytryptamine receptor 6
Ligand
BDBM103506
Substrate
Meas. Tech.
Radioligand Binding Assay
Ki
0.389±0.0 nM
IC50
0.837±0.0 nM
Citation
 Ivashchenko, AAKysil, VMSavchuk, NFIvashchenko, AV 2-amino-3-sulphonyl-tetrahydro-pyrazolo[1,5-A]pyrido-pyrimidine antagonists of serotonin 5-HT6 receptors, methods for the production and use thereof US Patent  US8552017 Publication Date 10/8/2013 
Target
Name:
5-hydroxytryptamine receptor 6
Synonyms:
5-HT-6 5-hydroxytryptamine receptor 6 (5-HT-6) 5-hydroxytryptamine receptor 6 (5HT6) HTR6 Serotonin 6 (5-HT6) receptor | Serotonin Receptor 6
Type:
G Protein-Coupled Receptor (GPCR)
Mol. Mass.:
46968.43
Organism:
Homo sapiens (Human)
Description:
P50406
Residue:
440
  
Inhibitor
Name:
BDBM103506
Synonyms:
CHEMBL2172186 | US8552017, 1.1(3).HCl
Type:
Small organic molecule
Emp. Form.:
C17H19N5O2S
Mol. Mass.:
357.43
SMILES:
CNc1nn2c3CCN(C)Cc3cnc2c1S(=O)(=O)c1ccccc1
: