Target
5-hydroxytryptamine receptor 6
Ligand
BDBM103508
Substrate
Meas. Tech.
Functional Assay
IC50
80±n/a nM
Citation
 Ivashchenko, AAIvashchenko, AVSavchuk, NF (EN) 3-sulfonyl-pyrazolo[1,5-a] pyrimidines / antagonists of serotonin 5-HT6 receptors, methods for the production and the use thereof US Patent  US8552005 Publication Date 10/8/2013 
Target
Name:
5-hydroxytryptamine receptor 6
Synonyms:
5-HT-6 5-hydroxytryptamine receptor 6 (5-HT-6) 5-hydroxytryptamine receptor 6 (5HT6) HTR6 Serotonin 6 (5-HT6) receptor | Serotonin Receptor 6
Type:
G Protein-Coupled Receptor (GPCR)
Mol. Mass.:
46968.43
Organism:
Homo sapiens (Human)
Description:
P50406
Residue:
440
  
Inhibitor
Name:
BDBM103508
Synonyms:
US8552005, 1.1(15)
Type:
Small organic molecule
Emp. Form.:
C17H19N3O2S2
Mol. Mass.:
361.482
SMILES:
CCSc1nn2c(C)cc(C)nc2c1S(=O)(=O)c1ccc(C)cc1
: