Target
Tyrosine-protein kinase ZAP-70
Ligand
BDBM103522
Substrate
Meas. Tech.
Enzyme Assay
IC50
8±n/a nM
Citation
 Okram, BUno, TDing, QLiu, YJin, YJin, QWu, XChe, JYan, SFHao, X Compounds and compositions as kinase inhibitors US Patent  US8546370 Publication Date 10/1/2013 
Target
Name:
Tyrosine-protein kinase ZAP-70
Synonyms:
70 kDa zeta-associated protein Syk-related tyrosine kinase Tyrosine-protein kinase ZAP-70 Tyrosine-protein kinase ZAP-70 (ZAP70) ZAP70 Zeta-chain (TCR) associated protein kinase 70kDa
Type:
Enzyme
Mol. Mass.:
69881.61
Organism:
Homo sapiens (Human)
Description:
ZAP-70 SH2 domain was expressed and purified from E. coli using O-phospho-L-tyrosine-agarose column.
Residue:
619
  
Inhibitor
Name:
BDBM103522
Synonyms:
US8546370, 190
Type:
Small organic molecule
Emp. Form.:
C23H22N6O2
Mol. Mass.:
414.4598
SMILES:
CNC(=O)C(C)(C)c1ccc(Nc2nc(cc3cc[nH]c(=O)c23)-c2cncnc2)cc1
: