Target
Sentrin-specific protease 1
Ligand
BDBM103828
Substrate
SUMO1
Meas. Tech.
SUMO Cleavage Assay
pH
7.4±0
IC50
2.027e+4± 2.47e+3 nM
Citation
 Madu, IGNamanja, ATSu, YWong, SLi, YJChen, Y Identification and Characterization of a New Chemotype of Noncovalent SENP Inhibitors. ACS Chem Biol 8:1435-41 (2013)  
Target
Name:
Sentrin-specific protease 1
Synonyms:
SENP1 Sentrin-specific protease 1 (SENP1)
Type:
Protein
Mol. Mass.:
73500.42
Organism:
Homo sapiens (Human)
Description:
Q9P0U3
Residue:
644
  
Inhibitor
Name:
BDBM103828
Synonyms:
SPI-03 | US11041859, Code SPI-03
Type:
Small organic molecule
Emp. Form.:
C34H28N6O6S2
Mol. Mass.:
680.753
SMILES:
Cc1cc(ccc1-c1ccc(cc1C)\N=N\c1cc(c2ccccc2c1N)S(O)(=O)=O)\N=N\c1cc(c2ccccc2c1N)S(O)(=O)=O
:
Substrate
Name:
Small ubiquitin-related modifier 1
Synonyms:
SMT3C SUMO1 Small ubiquitin-related modifier 1 | UBL1
Type:
Protein
Mol. Mass.:
11553.84
Organism:
Homo sapiens (Human)
Description:
Residue:
101